Jenkins return "unknown error -1=ffffffffffffffff" when building Xcode Project with Cocoapods - ios

I'm getting below error when trying to build Xcode workspace on Jenkins
usr/bin/codesign --force --sign B5E96BDFADAF51D771B158A29BF1D16565215A2D --preserve-metadata=identifier,entitlements '/Users/servicebuild/Desktop/Jenkins/workspace/Hello-Branch/build/Hello Test.app/Frameworks/Alamofire.framework'
16:06:07 /Users/servicebuild/Desktop/Jenkins/workspace/Hello-Branch/build/Hello Test.app/Frameworks/Alamofire.framework: unknown error -1=ffffffffffffffff
16:06:07 Command /bin/sh failed with exit code 1
16:06:07
16:06:07 ** BUILD FAILED **
16:06:07
16:06:07
16:06:07 The following build commands failed:
16:06:07 PhaseScriptExecution [CP]\ Embed\ Pods\ Frameworks /Users/servicebuild/Library/Developer/Xcode/DerivedData/Hello-dcvxwbnovymfusbrvfyyekingznu/Build/Intermediates.noindex/Garanti\ Filo.build/Release-iphoneos/Hello\ Hello\ Test.build/Script-2617FEF7DE193736656550249B.sh
I have more than one targets and in workspace scheme targets that I created are ticked as shared (not the pod targets). In pod project every framework has "Don't Code Sign" (As Default). I can successfully get IPA export from Xcode. However, when I try to build in Jenkins I get this error.
I tried solution in below post but can't figure out. I think the problem is Jenkins is forcing to sign pods when It doesn't need to.
Codesign returned unknown error -1=ffffffffffffffff

I figured out how to run below code (posted in the post added in my question) and it worked. Important point is that giving right path for keychain and password. Otherwise, It doesn't work.
security set-key-partition-list -S apple-tool:,apple:,codesign: -s -k password ${KEYCHAIN}

Related

how to solve codesign fail on mac with jenkis ci and electron-builder?

when i build in terminal codesign suceess but when i build in jenkins ci, throw error always.
the error content:
file=build/mac/VIPThink-test-online.app identityName=Developer ID xxxx identityHash=xxx provisioningProfile=none
Error: Command failed: codesign --sign xxx --force /Users/Shared/Jenkins/Home/workspace/pc-student-build-test/build/mac/VIPThink-test-online.app/Contents/Frameworks/Electron Framework.framework/Versions/A/Electron Framework
/Users/Shared/Jenkins/Home/workspace/pc-student-build-test/build/mac/VIPThink-test-online.app/Contents/Frameworks/Electron Framework.framework/Versions/A/Electron Framework: errSecInternalComponent
1st> just type this code in terminal
export CSC_IDENTITY_AUTO_DISCOVERY=false
2nd> run electron-builder --mac zip
It will temporarily create a zip without sign in key
It also successfully build the project for mac

":CFBundleIdentifier", Does Not Exist: ReactNative 0.58 on Mac / iOS

I am following the ReactNative tutorial for 0.58. I do everything it says to do and I am crashing after running react-native run-ios. I have seen this extremely similar SO question from 2016.
I attempted react-native upgrade and it recommended doing react-native-git-upgrade.This did nothing. Same problem.
The bit on running ./configure in the question above after cd-ing into glog did nothing. There was no configure script there. In the path NewStupidProject/node_modules/react-native/scripts there is a script called ios-configure-glog.sh. I run bash ios-configure-glog.sh and it says ios-configure-glog.sh: line 31: ./configure: No such file or directory.
I have also attempted setting Xcode to use the legacy build system. This did not fix the issue. I am restarting my laptop now to see if that makes any of these changes take effect. No luck. At the top it says:
Found Xcode project NewStupidProject.xcodeproj Building using
"xcodebuild -project NewStupidProject.xcodeproj -configuration Debug
-scheme NewStupidProject -destination id=854019D1-8EE7-4D13-87E1-385E6CAC21BE -derivedDataPath build" User
defaults from command line:
IDEDerivedDataPathOverride = /Users/me/NewStupidProject/ios/build
Prepare build
note: Using legacy build system
=== BUILD TARGET double-conversion OF PROJECT React WITH CONFIGURATION Debug ===
When I go into the home directory and run react-native --version the output is:
[NewStupidProject](master)$ react-native --version
react-native-cli: 2.0.1
react-native: 0.58.4
[NewStupidProject](master)$
My output after crashing is:
** BUILD FAILED **
The following build commands failed:
PhaseScriptExecution Install\ Third\ Party /Users/me/native_react_apps/NewStupidProject/ios/build/Build/Intermediates.noindex/React.build/Debug-iphonesimulator/double-conversion.build/Script-190EE32F1E6A43DE00A8543A.sh
(1 failure)
Installing
build/Build/Products/Debug-iphonesimulator/NewStupidProject.app An
error was encountered processing the command
(domain=NSPOSIXErrorDomain, code=22): Failed to install the requested
application The bundle identifier of the application could not be
determined. Ensure that the application's Info.plist contains a value
for CFBundleIdentifier. Print: Entry, ":CFBundleIdentifier", Does Not
Exist
Command failed: /usr/libexec/PlistBuddy -c Print:CFBundleIdentifier
build/Build/Products/Debug-iphonesimulator/NewStupidProject.app/Info.plist
Print: Entry, ":CFBundleIdentifier", Does Not Exist
Error: Command failed: /usr/libexec/PlistBuddy -c
Print:CFBundleIdentifier
build/Build/Products/Debug-iphonesimulator/NewStupidProject.app/Info.plist
Print: Entry, ":CFBundleIdentifier", Does Not Exist
at checkExecSyncError (child_process.js:637:11)
at Object.execFileSync (child_process.js:655:13)
at Promise.then (/Users/me/native_react_apps/NewStupidProject/node_modules/react-native/local-cli/runIOS/runIOS.js:208:5)
How is it possible for the setup process to be this fraught with errors and this difficult?
WHY is this error message not in the Troubleshooting ReactNative setup?
HOW do I fix this? Is it possible to avoid this altogether in the future?
Other versioning info:
XCode: 10.1
Command Line Tools: 10.1
yarn: 0.27.5
watchman: 4.9.0
homebrew: 2.0.1
npm: 6.8.0
node: v11.9.0
macOS: 10.13.6
UPDATE:
I am trying to implement the solution in this issue in GitHub and I'm getting:
dyld: Library not loaded:
/usr/local/opt/readline/lib/libreadline.7.dylib Referenced from:
/usr/local/bin/awk Reason: image not found
./ios-install-third-party.sh: line 20: 24497 Broken pipe: 13
shasum -p "$cachedir/$file"
24498 Abort trap: 6 | awk -v hash="$hash" '{exit $1 != hash}' Incorrect hash: 61067502c5f9769d111ea1ee3f74e6ddf0a5f9cc
?/Users/me/.rncache/glog-0.3.5.tar.gz
UPDATE No. 2 I am trying to run the watchman watch-del-all command as recommended here to clear the cache for RN > 0.50 and the whole thing is hanging.
I tried modify the build system and it worked for me.
Detail:
Open your project workspace file in Xcode, and
File -> Workspace Settings -> Build system -> Legacy Build system

Can not make script 'run-sonar-swift' works

I am trying to run sonar swift.
I have already sonarQube with the plugin and I can access it locally using this url http://localhost:9000 . I have installed all prerequisites that you can find here :
https://github.com/Backelite/sonar-swift
But I can't figure out what is this error when i launch run-sonar-swift.sh.
If anyone can bring me the light I would be very grateful.
Here the logs when I run in terminal command ./run-sonar-swift.sh -v :
MacBook-Air:streamus-phoenix-ios oboujaouane$ ./run-sonar-swift.sh -v
Running run-sonar-swift.sh...
Project count is [1]
Xcode project file is: Streamus.xcodeproj
Xcode workspace file is: Streamus.xcworkspace
Xcode application scheme is: Streamus Alpha
Destination simulator is: platform=iOS Simulator,name=iPhone 6,OS=11.3
Excluded paths from coverage are: .Tests.
Creating directory sonar-reports/
Running tests
+ xcodebuild clean build test -workspace Streamus.xcworkspace -scheme 'Streamus Alpha' -configuration Debug -enableCodeCoverage YES -destination 'platform=iOS Simulator,name=iPhone 6,OS=11.3' -destination-timeout 60
2018-05-12 10:34:14.031 xcodebuild[32149:775290] IDETestOperationsObserverDebug: Writing diagnostic log for test session to:
/var/folders/9v/vdbbf4j96hxgcxmtpntznytr0000gn/T/com.apple.dt.XCTest/IDETestRunSession-9A7EF764-6391-4C7D-9F34-066A9DFEC5E9/StreamusUITests-87E838E0-4F8F-4C19-B2AC-C2C0A274E8EC/Session-StreamusUITests-2018-05-12_103414-jhm3wz.log
2018-05-12 10:34:14.032 xcodebuild[32149:769805] [MT] IDETestOperationsObserverDebug: (98FB295E-FE60-46AA-8589-015B0DD2E617) Beginning test session StreamusUITests-98FB295E-FE60-46AA-8589-015B0DD2E617 at 2018-05-12 10:34:14.031 with Xcode 9E145 on target {
SimDevice: iPhone 6 (672DE879-E48B-45DA-BFD9-D0412F51A706, iOS 11.3, Booted)
} (11.3 (15E217))
2018-05-12 10:34:14.061 xcodebuild[32149:769805] [MT] IDETestOperationsObserverDebug: (458F86F6-1492-40F1-9F72-A88FC23BD985) Beginning test session StreamusTests-458F86F6-1492-40F1-9F72-A88FC23BD985 at
2018-05-12 10:34:14.061 with Xcode 9E145 on target {
SimDevice: iPhone 6 (672DE879-E48B-45DA-BFD9-D0412F51A706, iOS 11.3, Booted)
} (11.3 (15E217))
2018-05-12 10:34:14.061 xcodebuild[32149:770075] IDETestOperationsObserverDebug: Writing diagnostic log for test session to:
/var/folders/9v/vdbbf4j96hxgcxmtpntznytr0000gn/T/com.apple.dt.XCTest/IDETestRunSession-9A7EF764-6391-4C7D-9F34-066A9DFEC5E9/StreamusTests-4F203461-1372-49B7-A806-F130F168079E/Session-StreamusTests-2018-05-12_103414-MfIreE.log
2018-05-12 10:34:30.016 xcodebuild[32149:769805]
Error Domain=IDETestOperationsObserverErrorDomain Code=14 "Test operation was canceled. If you believe this error represents a bug, please attach the log file at /var/folders/9v/vdbbf4j96hxgcxmtpntznytr0000gn/T/com.apple.dt.XCTest/IDETestRunSession-9A7EF764-6391-4C7D-9F34-066A9DFEC5E9/StreamusUITests-87E838E0-4F8F-4C19-B2AC-C2C0A274E8EC/Session-StreamusUITests-2018-05-12_103414-jhm3wz.log"
UserInfo={NSLocalizedDescription=Test operation was canceled. If you believe this error represents a bug, please attach the log file at /var/folders/9v/vdbbf4j96hxgcxmtpntznytr0000gn/T/com.apple.dt.XCTest/IDETestRunSession-9A7EF764-6391-4C7D-9F34-066A9DFEC5E9/StreamusUITests-87E838E0-4F8F-4C19-B2AC-C2C0A274E8EC/Session-StreamusUITests-2018-05-12_103414-jhm3wz.log}
2018-05-12 10:34:30.016 xcodebuild[32149:769805] Error Domain=IDETestOperationsObserverErrorDomain Code=14 "Test operation was canceled. If you believe this error represents a bug, please attach the log file at /var/folders/9v/vdbbf4j96hxgcxmtpntznytr0000gn/T/com.apple.dt.XCTest/IDETestRunSession-9A7EF764-6391-4C7D-9F34-066A9DFEC5E9/StreamusTests-4F203461-1372-49B7-A806-F130F168079E/Session-StreamusTests-2018-05-12_103414-MfIreE.log" UserInfo={NSLocalizedDescription=Test operation was canceled. If you believe this error represents a bug, please attach the log file at /var/folders/9v/vdbbf4j96hxgcxmtpntznytr0000gn/T/com.apple.dt.XCTest/IDETestRunSession-9A7EF764-6391-4C7D-9F34-066A9DFEC5E9/StreamusTests-4F203461-1372-49B7-A806-F130F168079E/Session-StreamusTests-2018-05-12_103414-MfIreE.log}
Testing failed:
Linker command failed with exit code 1 (use -v to see invocation)
** TEST FAILED **
The following build commands failed:
Ld /Users/oboujaouane/Library/Developer/Xcode/DerivedData/Streamus-gwtdwpbaxrfgafdtejzjtpxyhhhq/Build/Intermediates.noindex/Streamus.build/Alpha-iphonesimulator/StreamusTests.build/Objects-normal/x86_64/StreamusTests normal x86_64
Ld /Users/oboujaouane/Library/Developer/Xcode/DerivedData/Streamus-gwtdwpbaxrfgafdtejzjtpxyhhhq/Build/Intermediates.noindex/Streamus.build/Alpha-iphonesimulator/StreamusTests.build/Objects-normal/i386/StreamusTests normal i386
(2 failures)
returnValue=65
set +x
ERROR - Command 'xcodebuild clean build test -workspace Streamus.xcworkspace -scheme Streamus Alpha -configuration Debug -enableCodeCoverage YES -destination platform=iOS Simulator,name=iPhone 6,OS=11.3 -destination-timeout 60' failed with error code: 65
In advance thank you,
It seems that error was due to provisioning profile. When I added my Provisioning Profile and try it again the problem was resolved.
Then I had another problem with MessageKit:“Segmentation fault: 11”
It was a CocoaPods Podfile config issue.
So I had to switch compilation mode for Debug from "Single File" to "Whole Module” by click on Pods in Xcode project navigator then select MessageKit in targets of pods then Builds settings tab then in searcher tap ‘compilation mode’ and switch “Single File” to “Whole Module” and re-run script run-sonar-swift.sh

⚠️ each time you make a pod install / update or something that can change pods you have to switch compilation mode for Debug from "Single File" to "Whole Module” for the pod which give you an error when you launch run-sonar.swift.sh with -v for verbose.
After that it was not yet the end of my problems! In fact I had a last problem which was an error with SwipeCellKit pod:
“No such module SwipeCellKit”.
To resolve this problem follow instructions given here https://stackoverflow.com/a/37732248/6188918
Then I tried again and the rest of the script started (SwiftLint, Tailor & Lizard) and I thought this time it was finally good but an error occurred once again a new error message at the end of the script concerning Lizard which was:
ERROR: Error during SonarQube Scanner execution
ERROR: File
MyprojectName/Domains/Repositories/Local/cacheManager.swift can't be
indexed twice. Please check that inclusion/exclusion patterns produce
disjoint sets for main and test files
ERROR: Re-run SonarQube Scanner using the -X switch to enable full
debug logging.
To resolve this inclusion/exclusion I followed the answer given here:
https://stackoverflow.com/a/40150551/6188918
by adding these to line in sonar-project.properties file below sonar.swift.excludedPathsFromCoverage line:
sonar.test.inclusions=**/*Test*/**
sonar.exclusions=**/*Test*/**
I tried again but with parameter -notailor(run script and skip Tailor):
./run-sonar-swift.sh -notailor -v
just to save a little time because tailor take time
And after launch the script... Boom a new error... But it was a known issue:
Error: Caused by: org.sonar.api.measures.PersistenceMode
And the issue is explained here https://github.com/Backelite/sonar-swift/issues/118
So I downloaded this .jar file “backelite-sonar-swift-plugin-0.4-sonar-7-quick-fix.jar” found here https://github.com/Hugal31/sonar-swift/releases/tag/0.4-sonar-7-quick-fix and replace it in plugins of my local SonarQube and try again.
…and this time after an umpteenth launch I finally saw the light 🤪💡
Hope this answer will help and if you have a question don’t hesitate.


Good luck & have fun :)
PS: You’ll find here some options to run script with parameters:
./run-sonar-swift.sh -noswiftlint -v (run script with verbose option and skip SwiftLint)
./run-sonar-swift.sh -notailor -v (run script with verbose option and skip Tailor)
./run-sonar-swift.sh -nounittests -v (if your project does not have scheme configured to be tested launch with this parameter)
If you want more info check in run-sonar-swift.sh script and check around lines 125 ## COMMAND LINE OPTIONS
PS2: I have also opened an issue in sonar-swift GitHub if it can help: https://github.com/Backelite/sonar-swift/issues/138
I had an extra issue with oclint: oclint: Not enough positional command line arguments specified!. So I had to modify the run-sonar-swift.sh script a little bit in order to get it working: https://gist.github.com/Edudjr/79a2379842357c33709aecf040d9ae77#file-run-sonar-swift-sh
And this is a model of my sonar-project.properties: https://gist.github.com/Edudjr/db51907068ea76b116d11d9a9b13f05f#file-sonar-project-properties

Jenkins error: /usr/bin/codesign --force failed exit code 1

I am configuring CI for my IOS project on MAC yosemite-OS and got on problem:
error: /usr/bin/codesign --force --preserve-metadata=identifier,entitlements,resource-rules --sign /Users/mitul/Desktop/jenkins_ios_profile/PCertificates.p12 --resource-rules=/var/folders/rj/cc6d38nn53v6tk8y4jn7ghkr0000gp/T/42RbMszHQX/Payload/XXX.app/ResourceRules.plist /var/folders/rj/cc6d38nn53v6tk8y4jn7ghkr0000gp/T/42RbMszHQX/Payload/XXX.app failed with error 1
even my build and archive are getting success but not able to make .ipa file
even tried all possibilities from this
/usr/bin/codesign failed with exit code 1 but no luck
Please help me what I am missing to do
My Xcode configuration is as follows:
Custom xcodebuild arguments:
CODE_SIGN_RESOURCE_RULES_PATH=/Users/mitul/Public/Xcode.app/Contents/Developer/Platforms/iPhoneOS.platform/Developer/SDKs/iPhoneOS.sdk/ResourceRules.plist
rest are all with default setting
I unchecked the code signing checkbox in jenkins project configuration and it started building, hope it can help some else too!

Jenkins can not run build Script

My Jenkins job set for an IOS Project clones (fetches) the code from Bitbucket but fails to run one of the last scripts for building the Xcode project.
The script is called.I get the following error it really does not mean a lot for me.
Has anyone had a similar problem.I am pretty sure that there is something wrong with the project settings since other jobs in the jenkins run perfect.
PhaseScriptExecution Run\ Script
/Users/jenkins/Library/Developer/Xcode/DerivedData/myApp-Workspace-doqiapyymubizteljhyzayqxdtyk/Build/Intermediates/Target.build/Release-iphoneos/Target.build/Script-334A8A5117785D7D001DC5DA.sh
cd "/Users/Shared/Jenkins/Home/workspace/myApp - BETA"
/bin/sh -c /Users/jenkins/Library/Developer/Xcode/DerivedData/myDriveriOSDriver-Workspace- doqiapyymubizteljhyzayqxdtyk/Build/Intermediates/Driver.build/Release-iphoneos/Driver.build/Script-334A8A5117785D7D001DC5DA.sh
fatal: Not a git repository: '/Users/Shared/Jenkins/Home/workspace/myApp - BETA/../.git'
VERSION: 2.1.3.0
2014-01-24 13:54:29.529 defaults[61460:507] Unexpected argument Driver; leaving defaults unchanged.
Command /bin/sh failed with exit code 1
** BUILD FAILED **
The following build commands failed:
PhaseScriptExecution Run\ Script /Users/jenkins/Library/Developer/Xcode/DerivedData/myApp- Workspace-doqiapyymubizteljhyzayqxdtyk/Build/Intermediates/Target.build/Release-iphoneos/Target.build/Script-334A8A5117785D7D001DC5DA.sh
(1 failure)
The mentioned script sets some environment variables before the fatal error including;
...
setenv YACC yacc
setenv arch armv7s
setenv variant normal
There is a clear error in the log:
fatal: Not a git repository: '/Users/Shared/Jenkins/Home/workspace/myApp - BETA/../.git'
By analyzing your error log I guess that problem is in following statement
cd "/Users/Shared/Jenkins/Home/workspace/myApp - BETA"
instead try
cd "/Users/Shared/Jenkins/Home/workspace/myApp\ -\ BETA"
hope it helps

Resources